{"text_format":"1","workbook":"xlsx","n_sheets":5,"sheets":["Ansuchen","Zusammenstellung","Datenblatt","Hilfe","Gemeindeliste"],"not_rendered":{"charts":0,"images":1,"macros":1,"external_links":0,"defined_names":0,"comments":0,"pivot_tables":0},"unopened":[],"bounds":{"document_bytes":16777216,"sheet_cells":100000,"rows_first":2000,"rows_last":500,"rows_between":2000,"halvings":0,"cell_chars":16384,"cell_head_chars":4096},"cells_cut":0,"cells_raw":0,"read":"whole","date_system":"1900"}

{"sheet":"Ansuchen","index":0,"n_rows":51,"n_cols":10,"rows_kept":51,"cut":false,"hidden":false,"merged":[[26,2,26,10],[3,4,3,5],[10,3,10,10],[11,3,11,10],[12,3,12,10],[13,3,13,10],[14,3,14,10],[17,3,17,10],[18,3,18,10],[21,2,21,10],[22,2,22,10],[29,3,29,10],[30,3,30,10],[33,3,33,10],[34,3,34,10],[35,3,35,10],[36,3,36,10],[39,9,39,10],[40,9,40,10],[41,9,41,10],[44,2,44,10],[43,2,43,10]]}
[null,"An den"]
[null,"NÖ Wasserwirtschaftsfonds"]
[null,"Landhausplatz 1, Haus 7a"]
[null,"3109 St.Pölten"]
[]
[]
[null,"Förderungsansuchen auf Gewährung von Mitteln aus dem NÖ Wasserwirtschaftsfonds "]
[null,"für Abwasserentsorgungsanlagen (ABA) "]
[]
[null,1,"Förderungswerber (Name des Antragstellers)"]
[null,null,"Name"]
[null,null,"Rechtsform"]
[null,null,"Straße/Nummer"]
[null,null,"Postleitzahl"]
[null,null,"Ort"]
[]
[null,2,"Bauabschnittsdaten"]
[null,null,"Kurzbezeichnung"]
[null,null,"Bauabschnitt"]
[]
[null,3,"Förderung des Bundes"]
[null,null,"Für das Vorhaben wurde gemäß § 16 ff des Umweltförderungsgesetzes um Gewährung von Förderungsmitteln angesucht. "]
[null,null,"Die entsprechenden Daten des Förderungsansuchens an den Bund werden auch für die Förderung des NÖ Wasserwirtschaftsfonds "]
[null,null,"herangezogen."]
[null,"3a","weitere Förderungen"]
[null,null,"Angabe, wenn (auch) andere Förderungen von Bund oder Land beantragt sind (Fördergeber, Förderausmaß):"]
[]
[]
[null,4,"Projekt"]
[null,null,"Erstellungsdatum"]
[null,null,"Projektsverfasser"]
[]
[null,5,"Wasserrechtliche Bewilligung"]
[null,null,"Datum der Anzeige gemäß WRG 1959"]
[null,null,"Datum Wasser-rechtsbescheid"]
[null,null,"Geschäftszahl"]
[null,null,"Behörde"]
[]
[null,6,"Investitionskosten (ohne Umsatzsteuer)"]
[null,null,"Beantragte förderfähige Gesamtkosten ",null,null,null,null,null,"EUR"]
{"$rows_left_out":12}
{"sheet":"Zusammenstellung","index":1,"n_rows":30,"n_cols":14,"rows_kept":30,"cut":false,"hidden":true,"merged":[[16,11,16,13],[27,7,27,8],[29,7,29,8],[0,0,0,8],[1,0,1,8],[3,2,3,8],[5,2,5,8],[9,2,9,3],[10,2,10,3],[12,7,12,8],[16,2,16,4],[16,6,16,8]]}
["N Ö  W A S S E R W I R T S C H A F T S F O N D S"]
["Zusammenstellung bei mehreren Kostenanteilen für einen Bauabschnitt ABA"]
[]
[null,"Förderungswerber","",null,null,null,null,null,null,null,null,"diese Spalten ausblenden"]
[]
[null,"           Bauabschnitt",""]
[]
[]
["Leitungsinformationssystem"]
[null,"Kosten",null,null,"EUR",null,null,null,null,null,null,"Kosten LIS gesamt",{"$f":"Datenblatt!E16+Datenblatt!E17+C10","v":0}]
[null,"Länge",null,null,"lfm",null,null,null,null,null,null,"Kosten ohne LIS",{"$f":"IF(ISERROR(E24),Datenblatt!E10-Datenblatt!E16-Datenblatt!E17,E24)","v":0}]
[]
[null,"Förderausmaß des NÖ WWF für Leitungsinformationssystem",null,null,null,null,"EUR",{"$f":"MIN(C11*0.5,C10*0.125)","v":0}]
[]
["Sonstige Kosten (ohne Leitungsinformationssystem)"]
[]
[null,null,"Investitionskostenanteil aufgeteilt nach Mindestförderung",null,null,null,"Förderung NÖ WWF aufgeteilt nach Mindestförd.",null,null,null,null,"Förderung NÖ WWF \naufgeteilt nach Mindestförd."]
[null,null,"mit 10 %","mit 20 %","ohne",null,"mit 10 %","mit 20 %","ohne",null,null,"mit 10 %","mit 20 %","ohne"]
["Nr","Verbandsmitglied/Gebührengebiet","        EUR","        EUR","        EUR",null,"%","%","%",null,null,"        EUR","        EUR","        EUR"]
[]
[{"$f":"A20+1","v":1},{"$f":"INDIRECT(\"'Anteil \"&VALUE($A21)&\"'!c3\")","v":{"$error":"#REF!"}},{"$f":"INDIRECT(\"'Anteil \"&VALUE($A21)&\"'!i12\")","v":{"$error":"#REF!"}},{"$f":"INDIRECT(\"'Anteil \"&VALUE($A21)&\"'!i13\")","v":{"$error":"#REF!"}},{"$f":"INDIRECT(\"'Anteil \"&VALUE($A21)&\"'!i14\")","v":{"$error":"#REF!"}},null,{"$f":"INDIRECT(\"'Anteil \"&VALUE($A21)&\"'!i79\")","v":{"$error":"#REF!"}},{"$f":"INDIRECT(\"'Anteil \"&VALUE($A21)&\"'!i80\")","v":{"$error":"#REF!"}},{"$f":"INDIRECT(\"'Anteil \"&VALUE($A21)&\"'!e77\")","v":{"$error":"#REF!"}},null,null,{"$f":"C21*G21/100","v":{"$error":"#REF!"}},{"$f":"D21*H21/100","v":{"$error":"#REF!"}},{"$error":"#REF!"}]
[]
[null,"Summe",{"$f":"SUM(C21:C22)","v":{"$error":"#REF!"}},{"$f":"SUM(D21:D22)","v":{"$error":"#REF!"}},{"$error":"#REF!"},null,null,null,null,null,null,{"$f":"SUM(L21:L22)","v":{"$error":"#REF!"}},{"$error":"#REF!"},{"$error":"#REF!"}]
[null,"Gesamtsumme BA",null,null,{"$f":"C23+D23+E23","v":{"$error":"#REF!"}}]
[]
[null,"gewichtetes prozentuelles Förderausmaß   [%]",null,null,null,null,{"$f":"ROUND(100*L23/C23,2)","v":{"$error":"#REF!"}},{"$f":"ROUND(100*M23/D23,2)","v":{"$error":"#REF!"}},{"$error":"#REF!"}]
[]
[null,"Förderausmaß des NÖ WWF ohne Leitungsinformationssystem  ",null,null,null,null,"EUR",{"$f":"L23+M23+N23","v":{"$error":"#REF!"}}]
[]
["Gesamtförderung",null,null,null,null,null,"EUR",{"$f":"H13+H28","v":{"$error":"#REF!"}}]

{"sheet":"Datenblatt","index":2,"n_rows":98,"n_cols":9,"rows_kept":98,"cut":false,"hidden":false,"merged":[[2,2,2,5],[4,2,4,5],[0,1,0,5],[1,1,1,5],[1,7,1,8],[3,7,3,8]]}
[null,"N Ö  W A S S E R W I R T S C H A F T S F O N D S"]
[null,"Datenblatt für Abwasserentsorgungsanlagen",null,null,null,null,null,"Tabellenblatt \"Gemeindeliste\" ausblenden"]
[null,"Förderungswerber"]
[null,null,null,null,null,null,null,"in dieser Spalte markierte Zeilen ausblenden"]
[null,"           Bauabschnitt / Gebührengebiet"]
[]
[null,"Datum Baubeginn"]
[null,"Datum Funktionsfähigkeit"]
[]
[null,"Investitionskosten Bauabschnitt ",null,null,null,"EUR"]
[null,"davon entfallen auf:"]
[null,"Versickerung/Retention Niederschlagsw. neue Gebiete",null,null,null,"EUR",null,"Summe Min 10",{"$f":"E12","v":0}]
[null,"Versickerung/Retention Niederschlagsw. Bestand",null,null,null,"EUR",null,"Summe Min 20",{"$f":"E13+E14","v":0}]
[null,"Maßnahmen Blackout-Vorsorge",null,null,null,"EUR",null,"ohne Mindest",{"$f":"E10-I12-I13","v":0}]
[null,"strategische Konzepte (z.B. Abwasser-, Regenwasserplan)",null,null,null,"EUR"]
[null,"Leitungsinformationssystem - Kanal",null,null,null,"EUR"]
[null,"Leitungsinformationssystem - Wasser",null,null,null,"EUR"]
[null,null,null,null,{"$f":"IF(SUM(E12:E17)>E10,\"FEHLER BEI BAUKOSTENAUFTEILUNG\",\"\")","v":""}]
[null,"gebührenpflichtige Liegenschaften vor dem Bauabschnitt",null,null,null,"Stk"]
[null,"(Nachweis bitte beilegen)"]
[null,"     davon Weinkeller und Ahnliches (erstmalig Nachweis beilegen)",null,null,null,"Stk"]
[]
[null,"anschlusspflichtige Liegenschaften im Bauabschnitt",null,null,null,"Stk"]
[null,"     davon Weinkeller und Ähnliches",null,null,null,"Stk"]
[]
["Durch Eingabe nachfolgender zusätzlicher Daten können Sie die Förderung errechnen:"]
[]
[null,"Gemeindenummer"]
[null,null,null,null,{"$f":"IF(E28=0,\"\",IF(ISERROR(VLOOKUP(E28,Gemeindeliste!$A$6:$B$578,2,FALSE)),\"Gemeindenummer ist falsch\",VLOOKUP(E28,Gemeindeliste!$A$6:$B$578,2,FALSE)))","v":""}]
[null,"Förderungsprozentsatz des Bundes    ",null,null,null,"%"]
[]
[null,"Leitungsinformationssystem - Kanal",null,null,null,"lfm",{"$f":"IF(AND(E16>0,E32=0),\"Länge fehlt\",\"\")","v":""}]
[null,"Leitungsinformationssystem - Wasser",null,null,null,"lfm",{"$f":"IF(AND(E17>0,E33=0),\"Länge fehlt\",\"\")","v":""}]
[]
[null,{"$f":"\"Altannuität im Jahr \"& IF(E51=1900,\"der FF\",E51)","v":"Altannuität im Jahr der FF"},null,null,null,"EUR"]
[null,{"$f":"\"Altannuität im Jahr \"&IF(E51=1900,\"der FF+1\",E51+1)","v":"Altannuität im Jahr der FF+1"},null,null,null,"EUR"]
[null,{"$f":"\"Altannuität im Jahr \"&IF(E51=1900,\"der FF+2\",E51+2)","v":"Altannuität im Jahr der FF+2"},null,null,null,"EUR"]
[]
[null,"Jahr der Fördereinreichung",null,null,2026,{"$f":"IF(E39=\"\",\"\",IF(E39<2023,\"darf nicht vor 2023 sein!\",\"\"))","v":""}]
[null,"Index des Einreichjahres",{"$f":"IF(E40<1,\"darf nicht unter 1,0 sein\",\"\")","v":""},null,1.0969]
{"$rows_left_out":59}
{"sheet":"Hilfe","index":3,"n_rows":47,"n_cols":3,"rows_kept":47,"cut":false,"hidden":false,"merged":[[0,1,0,2],[1,1,1,2]]}
[null,"N Ö  W A S S E R W I R T S C H A F T S F O N D S"]
[null,"Erläuterungen zum Ausfüllen von Förderansuchen und Datenblatt ABA"]
[]
[null,"Grundsätzliches"]
[null,null,"Die Eingabefelder sind grün hinterlegt und im Regelfall mit Zeilenumbruch versehen."]
[null,null,"Damit längere Eingaben auch zweizeilig dargestellt werden können, muss die Zeilenhöhe vergrößert werden."]
[null,null,"Alle Kostenangaben sind ohne Ust. zu machen."]
[]
[null,"Leitungsinformationssystem"]
[null,null,"Bei Bauabschnitten, die nur ein Leitungsinformationssystem umfassen, ist kein Datenblatt erforderlich."]
[]
[null,"Verbände oder mehrere Gebührengebiete"]
[null,null,"Bei Verbandsanlagen oder wenn ein Bauabschnitt mehrere Gebührengebiete umfasst, sind die zusätzlichen Datenblätter mit der Schaltfläche \"weiteres Datenblatt einfügen\" anzulegen."]
[null,null,"Die Datenblätter werden dann als \"Anteil 1\" etc. bezeichnet, gleichzeitig wird ein Tabellenblatt mit der Zusammenstellung der einzelnen Anteile eingeblendet."]
[]
[null,null,"In die Datenblätter mit den Verbandsanteilen sind nur die Kosten ohne ein allfälliges Leitungs-informationssystem aufzunehmen. Kosten und Längen von Leitungsinformationssystemen sind direkt in das Zusammenstellungs-Blatt einzutragen."]
[]
[null,null,"Bei Verbandsmitgliedern oder Gebührengebieten, für die keine Förderung erwartet wird, sind keine Detailangaben in den Datenblättern erforderlich und können sich die Angaben auf die Bezeichnung des Mitglieds/Gebührengebietes und die anteiligen Investitionskosten beschränken."]
[null,"Datenblatt"]
[null,null,"Das Datenblatt enthält jene Angaben, die zur Berechnung des Förderungsausmaßes erforderlich sind."]
[null,null,"Die Daten sind für das jeweils betroffene Gebührengebiet anzugeben. Dieses umfasst alle Anlagen einer Gemeinde, die eine gemeinsame Abgabenordnung haben. Anlagen einer Genossenschaft sind als getrenntes Gebührengebiet zu behandeln, auch wenn sie an eine Gemeindeanlage anschließen."]
[null,null,"Bei Gemeinden mit mehreren Gebührengebieten soll nach der Bezeichnung des Bauabschnitts auch das betroffene Gebührengebiet angeführt werden."]
[null,null,"Anteilige Investitionskosten für die Versickerung/Retention Niederschlagswasser neue Gebiete (mit anteiligen Kosten für Planung und Bauaufsicht) für: Lokale Niederschlagswasserver-sickerungsanlagen, Retentions- oder Verdunstungsanlagen für Gebiete mit erstmaliger Regenwasserentsorgung oder -behandlung."]
[null,null,"Anteilige Investitionskosten für die Versickerung/Retention Niederschlagswasser Bestand (mit anteiligen Kosten für Planung und Bauaufsicht) für: Lokale Niederschlagswasserver-sickerungsanlagen, Retentions- oder Verdunstungsanlagen für Gebiete mit bestehenden Anlagen."]
[null,null,"Anteilige Investitionskosten für Maßnahmen Blackout-Vorsorge (mit anteiligen Kosten für Planung und Bauaufsicht) für: Maßnahmen zur Ersatzstromversorgung mit Einspeisemöglichkeiten in die bestehende Stromversorgung (z.B. Notstromaggregate). "]
[null,null,"Anteilige (anerkannte endabgerechnete) Investitionskosten für Strategische Konzepte             (z.B. Abwasser-, Regenwasserplan, Black-Out Konzept), die dem eingereichten Bauabschnitt entsprechend zugeordnet werden können.    "]
[]
[null,null,"Die gebührenpflichtigen Liegenschaften vor dem Bauabschnitt sind die derzeit angeschlossenen Liegenschaften."]
[null,null,"Ein entsprechender Nachweis ist dem Förderungsansuchen beizulegen. Bei Gemeinden, die mit dem Buchhaltungsprogramm der GEMDAT oder dem Programm k5 arbeiten, erfolgt dies am besten durch die \"Liste Kanal nach Fläche\" (letzte Seite der zugehörigen Auswertung) und die darauf angeführte Gesamtanzahl der Objekte."]
[]
[null,null,"Unter davon Weinkeller und Ähnliches kann angeführt werden, wie viele der gebühren-pflichtigen Liegenschaften kleine, untergeordnete Objekte (z.B. Presshäuser, Schrebergärten) betreffen; diese stellen keine vollwertigen Liegenschaften im Sinne der Förderungsrichtlinien dar und gehen mit reduzierter Gebühr in die Berechnung ein."]
[null,null,"Bei erstmaliger Angabe ist ein entsprechender Nachweis dem Förderungsansuchen beizulegen. "]
[null,null,"Die anschlusspflichtigen Liegenschaften im Bauabschnitt sind jene, die durch den beantragten Bauabschnitt erfasst werden. Leerstehende Grundstücke oder solche mit Ausnahmebewilligung gemäß Bodenschutzgesetz sind daher nicht aufzunehmen, auch wenn aus technischen Gründen ein Anschluss bereits hergestellt wird."]
[null,null,"Bei neuen Siedlungsaufschließungen ist jene Anzahl anzugeben, die 1 bis 2 Jahre nach Funktionsfähigkeit des Bauabschnitts erwartet wird."]
[]
[null,null,"Unter davon Weinkeller und Ähnliches können jene kleinen, untergeordneten Objekte (z.B. Presshäuser, Schrebergärten) angeführt werden, die durch den beantragten Bauabschnitt erfasst werden. "]
[]
[null,"Vorabberechnung des Förderausmaßes"]
[null,null,"Durch Eingabe der Daten unter dem Unterschriftsblock kann das Förderausmaß auf Grund der Eintragungen berechnet werden."]
[null,null,"Nach dem errechneten Fördersatz wird auch ausgeworfen, für welche Investitionskosten ein höherer Fördersatz zum Tragen kommt. Ist der errechnete Fördersatz schon höher als 10 bzw. 20% werden keine relevanten Investionskosten ausgegeben, auch wenn es Investitonskosten für entsprechende Maßnahmen gibt (z.B. für Maßnahmen Blackout-Vorsorge)"]
{"$rows_left_out":8}
{"sheet":"Gemeindeliste","index":4,"n_rows":578,"n_cols":11,"rows_kept":578,"cut":false,"hidden":true,"merged":[[2,6,2,9]]}
["bei Änderung der \"GemeindedatenFRL2016\" sind die neuen Zahlen in untenstehende Tabelle zu kopieren (Inhalte einfügen)"]
[null,"und allenfalls das gelb hinterlegte Betriebskosten-Jahr anzupassen"]
[null,null,null,null,null,null,"Betriebskosten ABA [EUR/(Wo+AS)]  lt. Formel Index 1,0"]
[null,null,null,null,null,null,{"$f":"H4-1","v":2022},2023,{"$f":"H4+1","v":2024},{"$f":"I4+1","v":2025}]
["GdeNrZl","Gemeinde","Gebühren-stufe ","Einkommensindex ","Eigenanteil","Gebühren-faktor","alte Betriebs-kosten vor  Neuberech-nung","im Jahr der Änderung","im Jahr dazwischen","Betriebskosten lt. Neuberechnung","Wohnungs-faktor (Wo+AS/ Gebäude)"]
[30101,"Krems an der Donau",3,21845.200000000001,24.91,2.3937344250622998,152.06959831692677,152.06959831692677,152.06959831692677,152.06959831692677,2.9921680313278749]
[30201,"Sankt Pölten",3,22515.599999999999,26.87,2.1371955233706386,154.23428495209717,154.23428495209717,154.23428495209717,154.23428495209717,2.6714944042132984]
[30301,"Waidhofen an der Ybbs",3,22491.4,26.8,1.7427096774193551,216.62567982035088,216.62567982035088,216.62567982035088,216.62567982035088,2.1783870967741934]
[30401,"Wiener Neustadt",3,22246.400000000001,26.08,2.1885057471264369,146.50237192771613,146.50237192771613,146.50237192771613,146.50237192771613,2.735632183908046]
[30501,"Allhartsberg",4,22908.2,28.03,1.2562962962962965,229.43707717930903,229.43707717930903,229.43707717930903,229.43707717930903,1.5703703703703704]
[30502,"Amstetten",4,22803.4,27.72,1.8602524735585126,157.79888434650735,157.79888434650735,157.79888434650735,157.79888434650735,2.3253155919481405]
[30503,"Ardagger",3,22253.200000000001,26.1,1.2214132762312633,244.50853284067708,244.50853284067708,244.50853284067708,244.50853284067708,1.5267665952890792]
[30504,"Aschbach-Markt",3,22529.200000000001,26.91,1.3481781376518218,223.34107208793725,223.34107208793725,223.34107208793725,223.34107208793725,1.6852226720647774]
[30506,"Behamberg",4,23876.6,30,1.2991666666666668,198.80894260613235,198.80894260613235,198.80894260613235,198.80894260613235,1.6239583333333334]
[30507,"Biberbach",3,22606,27.14,1.2859154929577465,240.97224532378112,240.97224532378112,240.97224532378112,240.97224532378112,1.607394366197183]
[30508,"Ennsdorf",3,22531.599999999999,26.92,1.4761670761670764,166.04052831935292,166.04052831935292,166.04052831935292,166.04052831935292,1.8452088452088453]
[30509,"Ernsthofen",4,24008.2,30,1.2412979351032449,210.09575919793832,210.09575919793832,210.09575919793832,210.09575919793832,1.5516224188790559]
[30510,"Ertl",2,21212,23.05,1.2515759312320918,253.80299391699427,253.80299391699427,253.80299391699427,253.80299391699427,1.5644699140401146]
[30511,"Euratsfeld",3,21830.6,24.87,1.1622188905547226,241.9547635502235,241.9547635502235,241.9547635502235,241.9547635502235,1.4527736131934033]
[30512,"Ferschnitz",4,23037.4,28.4,1.1266932270916334,222.50703226698423,222.50703226698423,222.50703226698423,222.50703226698423,1.4083665338645419]
[30514,"Haag",3,22151,25.81,1.493795863909273,216.86334143187358,216.86334143187358,216.86334143187358,216.86334143187358,1.8672448298865911]
[30515,"Haidershofen",4,23737,30,1.311023622047244,215.98777218566909,215.98777218566909,215.98777218566909,215.98777218566909,1.6387795275590551]
[30516,"Hollenstein an der Ybbs",2,20639.8,21.37,1.3148264984227129,336.76659089291377,336.76659089291377,336.76659089291377,336.76659089291377,1.6435331230283912]
[30517,"Kematen an der Ybbs",2,21733,24.58,1.5893961708394699,181.1791149566306,181.1791149566306,181.1791149566306,181.1791149566306,1.9867452135493373]
[30520,"Neuhofen an der Ybbs",3,22542.2,26.95,1.2157894736842105,241.66880018741833,241.66880018741833,241.66880018741833,241.66880018741833,1.5197368421052631]
[30521,"Neustadtl an der Donau",2,21669.4,24.39,1.0956521739130434,271.04640282119237,271.04640282119237,271.04640282119237,271.04640282119237,1.3695652173913044]
[30522,"Oed-Oehling",4,24409.200000000001,30,1.2543209876543211,201.59720385476061,201.59720385476061,201.59720385476061,201.59720385476061,1.5679012345679013]
[30524,"Opponitz",2,21031,22.52,1.1340350877192984,319.55531603275887,319.55531603275887,319.55531603275887,319.55531603275887,1.4175438596491228]
[30526,"Sankt Georgen am Reith",2,19156.400000000001,20,1.0101382488479262,352.42942043065824,352.42942043065824,352.42942043065824,352.42942043065824,1.2626728110599079]
[30527,"Sankt Georgen am Ybbsfelde",3,22340.6,26.36,1.2632111251580278,213.71692033505374,213.71692033505374,213.71692033505374,213.71692033505374,1.5790139064475348]
[30529,"Sankt Pantaleon-Erla",4,23431.8,29.56,1.24106463878327,225.09114224587663,225.09114224587663,225.09114224587663,225.09114224587663,1.5513307984790874]
[30530,"Sankt Peter in der Au",3,22641.8,27.24,1.2883345561261923,233.718766068267,233.718766068267,233.718766068267,233.718766068267,1.6104181951577403]
[30531,"Sankt Valentin",4,23263.8,29.07,1.6829015544041452,183.02231790958905,183.02231790958905,183.02231790958905,183.02231790958905,2.1036269430051813]
[30532,"Seitenstetten",3,21935.200000000001,25.17,1.2548494983277594,221.75578931416993,221.75578931416993,221.75578931416993,221.75578931416993,1.5685618729096991]
[30533,"Sonntagberg",2,21737.4,24.59,1.5923298178331737,184.00267596047431,184.00267596047431,184.00267596047431,184.00267596047431,1.990412272291467]
[30534,"Strengberg",2,21419.599999999999,23.66,1.3369308600337269,251.80388014073122,251.80388014073122,251.80388014073122,251.80388014073122,1.6711635750421585]
[30536,"Viehdorf",3,21820.6,24.84,1.2212885154061626,237.34984489954084,237.34984489954084,237.34984489954084,237.34984489954084,1.526610644257703]
[30538,"Wallsee-Sindelburg",4,22870,27.91,1.2563847429519073,233.94217146902733,233.94217146902733,233.94217146902733,233.94217146902733,1.570480928689884]
[30539,"Weistrach",3,21817.4,24.83,1.3463414634146342,251.15085598964902,251.15085598964902,251.15085598964902,251.15085598964902,1.6829268292682926]
[30541,"Winklarn",4,23492.2,29.74,1.2075156576200416,211.38222298515893,211.38222298515893,211.38222298515893,211.38222298515893,1.5093945720250521]
{"$rows_left_out":538}